IPB
ЛогинПароль:

> Внимание!

1. Пользуйтесь тегами кода. - [code] ... [/code]
2. Точно указывайте язык, название и версию компилятора (интерпретатора).
3. Название темы должно быть информативным. В описании темы указываем язык!!!

2 страниц V < 1 2  
 Ответить  Открыть новую тему 
> подсчёт символов
сообщение
Сообщение #21


Новичок
*

Группа: Пользователи
Сообщений: 16
Пол: Мужской

Репутация: -  0  +


Ребята извините, но терь я не могу понять что ещё нужно?

Элементов 256, числа в масиве любые из диапозона Int, язык С, компилятор Visual C
 Оффлайн  Профиль  PM 
 К началу страницы 
+ Ответить 
сообщение
Сообщение #22


Новичок
*

Группа: Пользователи
Сообщений: 16
Пол: Мужской

Репутация: -  0  +


Друзья ну помогите пожалуйста вроди вё что нужно привёл, условие более или менее понятно, некоторые условия привёл, что не сказал, так и нам того препод не говорит, значит на своё усмотрение это его не так интересует. Я ведь не заинтересован задерживать Вас...что знал всё сказал.
По прежнему надеюсь на Вашу помощь
 Оффлайн  Профиль  PM 
 К началу страницы 
+ Ответить 
сообщение
Сообщение #23


Perl. Just code it!
******

Группа: Пользователи
Сообщений: 4 100
Пол: Мужской
Реальное имя: Андрей

Репутация: -  44  +


Цитата
Элементов 256, числа в масиве любые из диапозона Int, язык С, компилятор Visual C


Чем моя программа не подошла ?


--------------------
perl -e 'print for (map{chr(hex)}("4861707079204E6577205965617221"=~/(.{2})/g)), "\n";'
 Оффлайн  Профиль  PM 
 К началу страницы 
+ Ответить 
сообщение
Сообщение #24


Новичок
*

Группа: Пользователи
Сообщений: 16
Пол: Мужской

Репутация: -  0  +


Почему то вот это пишет, понимаю, что твой исходник верен, но на что вот компиль ругается понять не могу....поясни пожалуйста


Цитата
1>------ Build started: Project: Proba2, Configuration: Debug Win32 ------
1>Compiling...
1>main.c
1>c:\documents and settings\vbproffi\my documents\visual studio 2005\projects\proba2\proba2\main.c(5) : error C2143: syntax error : missing ')' before '&'
1>c:\documents and settings\vbproffi\my documents\visual studio 2005\projects\proba2\proba2\main.c(5) : error C2143: syntax error : missing '{' before '&'
1>c:\documents and settings\vbproffi\my documents\visual studio 2005\projects\proba2\proba2\main.c(5) : error C2059: syntax error : '&'
1>c:\documents and settings\vbproffi\my documents\visual studio 2005\projects\proba2\proba2\main.c(5) : error C2059: syntax error : ')'
1>c:\documents and settings\vbproffi\my documents\visual studio 2005\projects\proba2\proba2\main.c(19) : error C2143: syntax error : missing ';' before 'type'
1>c:\documents and settings\vbproffi\my documents\visual studio 2005\projects\proba2\proba2\main.c(19) : error C2143: syntax error : missing ';' before 'type'
1>c:\documents and settings\vbproffi\my documents\visual studio 2005\projects\proba2\proba2\main.c(19) : error C2143: syntax error : missing ')' before 'type'
1>c:\documents and settings\vbproffi\my documents\visual studio 2005\projects\proba2\proba2\main.c(19) : error C2143: syntax error : missing ';' before 'type'
1>c:\documents and settings\vbproffi\my documents\visual studio 2005\projects\proba2\proba2\main.c(19) : error C2065: 'i' : undeclared identifier
1>c:\documents and settings\vbproffi\my documents\visual studio 2005\projects\proba2\proba2\main.c(19) : warning C4552: '<' : operator has no effect; expected operator with side-effect
1>c:\documents and settings\vbproffi\my documents\visual studio 2005\projects\proba2\proba2\main.c(19) : error C2059: syntax error : ')'
1>c:\documents and settings\vbproffi\my documents\visual studio 2005\projects\proba2\proba2\main.c(19) : error C2146: syntax error : missing ';' before identifier 'printf'
1>c:\documents and settings\vbproffi\my documents\visual studio 2005\projects\proba2\proba2\main.c(30) : error C2143: syntax error : missing ';' before 'type'
1>c:\documents and settings\vbproffi\my documents\visual studio 2005\projects\proba2\proba2\main.c(30) : error C2143: syntax error : missing ';' before 'type'
1>c:\documents and settings\vbproffi\my documents\visual studio 2005\projects\proba2\proba2\main.c(30) : error C2143: syntax error : missing ')' before 'type'
1>c:\documents and settings\vbproffi\my documents\visual studio 2005\projects\proba2\proba2\main.c(30) : error C2143: syntax error : missing ';' before 'type'
1>c:\documents and settings\vbproffi\my documents\visual studio 2005\projects\proba2\proba2\main.c(30) : error C2065: 'j' : undeclared identifier
1>c:\documents and settings\vbproffi\my documents\visual studio 2005\projects\proba2\proba2\main.c(30) : warning C4552: '<' : operator has no effect; expected operator with side-effect
1>c:\documents and settings\vbproffi\my documents\visual studio 2005\projects\proba2\proba2\main.c(30) : error C2059: syntax error : ')'
1>c:\documents and settings\vbproffi\my documents\visual studio 2005\projects\proba2\proba2\main.c(31) : error C2146: syntax error : missing ';' before identifier 'arr'
1>c:\documents and settings\vbproffi\my documents\visual studio 2005\projects\proba2\proba2\main.c(46) : error C2143: syntax error : missing ';' before 'type'
1>c:\documents and settings\vbproffi\my documents\visual studio 2005\projects\proba2\proba2\main.c(50) : error C2143: syntax error : missing ';' before 'type'
1>c:\documents and settings\vbproffi\my documents\visual studio 2005\projects\proba2\proba2\main.c(50) : error C2143: syntax error : missing ';' before 'type'
1>c:\documents and settings\vbproffi\my documents\visual studio 2005\projects\proba2\proba2\main.c(50) : error C2143: syntax error : missing ')' before 'type'
1>c:\documents and settings\vbproffi\my documents\visual studio 2005\projects\proba2\proba2\main.c(50) : error C2143: syntax error : missing ';' before 'type'
1>c:\documents and settings\vbproffi\my documents\visual studio 2005\projects\proba2\proba2\main.c(50) : warning C4552: '<' : operator has no effect; expected operator with side-effect
1>c:\documents and settings\vbproffi\my documents\visual studio 2005\projects\proba2\proba2\main.c(50) : error C2059: syntax error : ')'
1>c:\documents and settings\vbproffi\my documents\visual studio 2005\projects\proba2\proba2\main.c(51) : error C2143: syntax error : missing ';' before 'if'
1>c:\documents and settings\vbproffi\my documents\visual studio 2005\projects\proba2\proba2\main.c(61) : warning C4013: 'clrscr' undefined; assuming extern returning int
1>c:\documents and settings\vbproffi\my documents\visual studio 2005\projects\proba2\proba2\main.c(63) : error C2143: syntax error : missing ';' before 'type'
1>c:\documents and settings\vbproffi\my documents\visual studio 2005\projects\proba2\proba2\main.c(65) : error C2143: syntax error : missing ';' before 'type'
1>c:\documents and settings\vbproffi\my documents\visual studio 2005\projects\proba2\proba2\main.c(67) : error C2065: 'n' : undeclared identifier
1>c:\documents and settings\vbproffi\my documents\visual studio 2005\projects\proba2\proba2\main.c(69) : warning C4013: 'InitArray' undefined; assuming extern returning int
1>c:\documents and settings\vbproffi\my documents\visual studio 2005\projects\proba2\proba2\main.c(69) : error C2065: 'arr' : undeclared identifier
1>c:\documents and settings\vbproffi\my documents\visual studio 2005\projects\proba2\proba2\main.c(70) : warning C4047: 'function' : 'int *' differs in levels of indirection from 'int'
1>c:\documents and settings\vbproffi\my documents\visual studio 2005\projects\proba2\proba2\main.c(70) : warning C4024: 'GetInfo' : different types for formal and actual parameter 1
1>Build log was saved at "file://c:\Documents and Settings\VBproffi\My Documents\Visual Studio 2005\Projects\Proba2\Proba2\Debug\BuildLog.htm"
1>Proba2 - 29 error(s), 7 warning(s)
========== Build: 0 succeeded, 1 failed, 0 up-to-date, 0 skipped ==========
 Оффлайн  Профиль  PM 
 К началу страницы 
+ Ответить 
сообщение
Сообщение #25


Perl. Just code it!
******

Группа: Пользователи
Сообщений: 4 100
Пол: Мужской
Реальное имя: Андрей

Репутация: -  44  +


Поставь компилятор попроще smile.gif

Присоединяю Borland C 3.0, не так красиво как VS, но прогу запустишь без рпоблем))

Не забудь прописать правильные пути в Options->Directories


Прикрепленные файлы
Прикрепленный файл  bc30.rar ( 1.47 мегабайт ) Кол-во скачиваний: 56


--------------------
perl -e 'print for (map{chr(hex)}("4861707079204E6577205965617221"=~/(.{2})/g)), "\n";'
 Оффлайн  Профиль  PM 
 К началу страницы 
+ Ответить 
сообщение
Сообщение #26


Новичок
*

Группа: Пользователи
Сообщений: 16
Пол: Мужской

Репутация: -  0  +


понимаю, но препод заставляет на этом компиле... я и с задачей про домину из - за того и мучаюсь, что на вижале сдать надо иначе бы давно уже исходник запустил.... Даже не знаю....
 Оффлайн  Профиль  PM 
 К началу страницы 
+ Ответить 
сообщение
Сообщение #27


Perl. Just code it!
******

Группа: Пользователи
Сообщений: 4 100
Пол: Мужской
Реальное имя: Андрей

Репутация: -  44  +


Так тебе код нужен на ЧИСТОМ C ? Или С++ ?


--------------------
perl -e 'print for (map{chr(hex)}("4861707079204E6577205965617221"=~/(.{2})/g)), "\n";'
 Оффлайн  Профиль  PM 
 К началу страницы 
+ Ответить 
сообщение
Сообщение #28


Новичок
*

Группа: Пользователи
Сообщений: 16
Пол: Мужской

Репутация: -  0  +


На чистом С
Мыпросто создаём проект С++, потом создаём файл source и расширешние срр меняем на с, потом запускаем и ждём....вот так...так тчо надо на С. Дико конечно как-то, но что поделать
 Оффлайн  Профиль  PM 
 К началу страницы 
+ Ответить 
сообщение
Сообщение #29


Perl. Just code it!
******

Группа: Пользователи
Сообщений: 4 100
Пол: Мужской
Реальное имя: Андрей

Репутация: -  44  +


VS2003

Win32ConsoleApplication :

#include "stdafx.h"

void InitArray(int *&arr, int n)
{
arr = (int*)malloc(n * sizeof(int));

for (int i = 0; i < n; i++)
{
printf("arr[%d]=", i);
scanf("%d", (arr+i));
}
}


void PrintArray(int *arr, int n)
{
printf("\n");
for (int i = 0; i < n; i++) printf("arr[%d] = %d\n", i, arr[i]);
}

int Del(int *arr, int n, int value)
{
int i = 0;

while (i < n)
{
if (arr[i] == value)
{
for (int j = i; j < n; j++)
arr[j] = arr[j+1];
--n;
}
else i++;
}

return n;

}


void GetInfo(int *arr, int n)
{
printf("\n");

int i = 0;
while (i < n)
{
int count = 1;
for (int j = i + 1; j < n; j++)
if (arr[i] == arr[j]) count++;
printf("%d - %d\n", arr[i], count);
n = Del(arr, n, arr[i]);
}
}



int _tmain(int argc, _TCHAR* argv[])
{
int *arr;

int n;

printf("n = "); scanf("%d", &n);

InitArray(arr, n);
GetInfo(arr, n);

return 0;

}


Работает без проблем


--------------------
perl -e 'print for (map{chr(hex)}("4861707079204E6577205965617221"=~/(.{2})/g)), "\n";'
 Оффлайн  Профиль  PM 
 К началу страницы 
+ Ответить 
сообщение
Сообщение #30


Новичок
*

Группа: Пользователи
Сообщений: 16
Пол: Мужской

Репутация: -  0  +


понимаю, что всё работает, но я не понимаю почему мой компиль пишут вот это

1>c:\documents and settings\vbproffi\my documents\visual studio 2005\projects\qwe123\qwe123\123.c(1) : fatal error C1083: Cannot open include file: 'stdafx.h': No such file or directory
 Оффлайн  Профиль  PM 
 К началу страницы 
+ Ответить 

2 страниц V < 1 2
 Ответить  Открыть новую тему 
1 чел. читают эту тему (гостей: 1, скрытых пользователей: 0)
Пользователей: 0

 




- Текстовая версия 20.09.2017 11:05
Хостинг предоставлен компанией "Веб Сервис Центр" при поддержке компании "ДокЛаб"